(+/-)-1-Methoxy-4-methylpentane-3-thiol
- Formula: C7H16OS
- Molecular weight: 148.266
- IUPAC Standard InChIKey: MXDSGTTVQNVYGY-UHFFFAOYSA-N
- Chemical structure:
View 3d structure (requires JavaScript / HTML 5) - Permanent link for this species. Use this link for bookmarking this species for future reference.

Normal alkane RI, non-polar column, temperature ramp

Column type | Active phase | I | Reference | Comment |
---|---|---|---|---|
Capillary | SPB-1 | 1029. | van de Waal, Niclass, et al., 2002 | 30. m/0.25 mm/0.25 μm, He, 50. C @ 5. min, 5. K/min, 240. C @ 20. min |

Normal alkane RI, polar column, temperature ramp

Column type | Active phase | I | Reference | Comment |
---|---|---|---|---|
Capillary | Supelcowax-20M | 1345. | van de Waal, Niclass, et al., 2002 | 50. C @ 5. min, 5. K/min, 240. C @ 20. min |

References

van de Waal, Niclass, et al., 2002
van de Waal, M.; Niclass, Y.; Snowden, R.L.; Bernardinelli, G.; Escher, S.,
1-Methoxyhexane-3-thiol, a powerful odorant of clary sage (Salvia sclarea L.),
Helv. Chim. Acta, 2002, 85, 5, 1246-1260, https://doi.org/10.1002/1522-2675(200205)85:5<1246::AID-HLCA1246>3.0.CO;2-O
. [all data]