6-Terpineol
- Formula: C10H18O
- Molecular weight: 154.2493
- IUPAC Standard InChIKey: SQIFACVGCPWBQZ-UHFFFAOYSA-N
- Chemical structure:
View 3d structure (requires JavaScript / HTML 5) - Species with the same structure:

Normal alkane RI, non-polar column, temperature ramp

Column type | Active phase | I | Reference | Comment |
---|---|---|---|---|
Capillary | ZEBRON-5 | 1095. | Öztürk, Akay, et al., 2002 | 6. m/0.25 mm/0.25 μm, He, 40. C @ 5. min, 3. K/min, 200. C @ 15. min |

References

Öztürk, Akay, et al., 2002
Öztürk, M.; Akay, F.; Duru, M.E.; Bilsel, G.; Harmandar, M.,
The volatile oil constituents and biological activity of aerial part of Inula heterolepis Boiss.,
Proc. ICNP-2002 - Trabzon/Turkiye, 2002, 298-303. [all data]