3,4-Dimethylpentanoic acid

Normal alkane RI, non-polar column, temperature ramp

View large format table.

Column type Active phase I Reference Comment
CapillarySPB-51052.Fontanille, le Flèche, et al., 200230. m/0.32 mm/0.25 μm, N2, 80. C @ 5. min, 20. K/min; Tend: 220. C

References

Fontanille, le Flèche, et al., 2002
Fontanille, P.; le Flèche, A.; Larroche, C., Pseudomonas rhodesiae PF1: a new and efficient biocatalyst for production of isonovalal from α-pinene oxide, Biocatal. Biotransform., 2002, 20, 6, 413-421, https://doi.org/10.1080/1024242021000058702 . [all data]