2,4,6-Tri-isopropyl-[1,3,5]trithiane

Normal alkane RI, polar column, temperature ramp

Data compiled by: NIST Mass Spectrometry Data Center, William E. Wallace, director

Column type Capillary
Active phase FFAP
Column length (m) 50.
Carrier gas
Substrate
Column diameter (mm) 0.22
Phase thickness (μm)
Tstart (C) 60.
Tend (C) 230.
Heat rate (K/min) 2.
Initial hold (min) 8.
Final hold (min)
I 2070.
ReferenceVernin, Metzger, et al., 1993
Comment MSDC-RI

References

Vernin, Metzger, et al., 1993
Vernin, G.; Metzger, J.; Sultan, A.A.M.; El-Shafei, A.K.; Párkányi, C., Heterocyclic compounds in model systems for the Maillard reaction. Reactions of aldehydes with ammonium sulfide in the presence or absence of acetoin, Am. Chem. Soc. Symp. Ser., 1993, 528, 36-55. [all data]