5-(3,5-dimethylheptanyl)-3-methyl-2H-pyran-2-one, diastereomer 1

Van Den Dool and Kratz RI, polar column, temperature ramp

Data compiled by: NIST Mass Spectrometry Data Center, William E. Wallace, director

Column type Capillary
Active phase Carbowax
Column length (m) 30.
Carrier gas He
Substrate
Column diameter (mm) 0.25
Phase thickness (μm) 0.25
Tstart (C) 80.
Tend (C) 240.
Heat rate (K/min) 10.
Initial hold (min) 2.
Final hold (min) 20.
I 2585.
ReferenceCharlton, Webster, et al., 1993
Comment MSDC-RI

References

Charlton, Webster, et al., 1993
Charlton, R.E.; Webster, F.X.; Zhang, A.; Schal, C.; Liang, D.; Sreng, I.; Roelofs, W.L., Sex pheromone for the brownbanded cockroach is an unusual dialkyl-substituted α-pyrone, Proc. Natl. Acad. Sci. U.S.A, 1993, 90, 21, 10202-10205, https://doi.org/10.1073/pnas.90.21.10202 . [all data]