α-Galactofuranose, TMS
- Formula: C21H52O6Si5
- Molecular weight: 541.0615
- IUPAC Standard InChIKey: ZIWXPOHHTJQHTN-XKRYSZRTSA-N
- Chemical structure:
View 3d structure (requires JavaScript / HTML 5) - Stereoisomers:
- β-D-Galactofuranose, 1,2,3,5,6-pentakis-O-(trimethylsilyl)-
- β-Gulofuranose, TMS
- D(+)-Galactose, furanose, TMS
- α-Altrofuranose, TMS
- α-Gulofuranose, TMS
- β-Allofuranose, TMS
- β-Altrofuranose, TMS
- Methyl galactofuranoside, TMS
- D-(+)-Talofuranose, pentakis(trimethylsilyl) ether (isomer 2)
- D-(+)-Talofuranose, pentakis(trimethylsilyl) ether (isomer 1)
- D-Allofuranose, pentakis(trimethylsilyl) ether

Kovats' RI, non-polar column, isothermal

Column type | Active phase | Temperature (C) | I | Reference | Comment |
---|---|---|---|---|---|
Capillary | SE-54 | 180. | 1941. | Martinez-Castro, Paez, et al., 1989 | Supelcoport; Column length: 40. m; Column diameter: 0.18 mm |

Kovats' RI, polar column, isothermal

Column type | Active phase | Temperature (C) | I | Reference | Comment |
---|---|---|---|---|---|
Capillary | Carbowax 20M | 160. | 1869. | Martinez-Castro, Paez, et al., 1989 | Chrompack; Column length: 25. m; Column diameter: 0.22 mm |

References

Martinez-Castro, Paez, et al., 1989
Martinez-Castro, I.; Paez, M.I.; Sanz, J.; Garcia-Raso, A.,
Gas Chromatographic Behaviour of Carbohydrate Trimethylsilyl Ethers. II. Aldohexoses,
J. Chromatogr., 1989, 462, 49-60, https://doi.org/10.1016/S0021-9673(00)91335-9
. [all data]