galactitol, acetylated

Kovats' RI, non-polar column, isothermal

View large format table.

Column type Active phase Temperature (C) I Reference Comment
CapillaryOV-101200.2070.4Adam, 1981Column length: 50. m

References

Adam, 1981
Adam, S., Separation of mono- and di-saccharide derivatives by high-resolution gas chromatography, Z. Lebensm. Unters. Forsch., 1981, 173, 2, 109-112, https://doi.org/10.1007/BF01042273 . [all data]