2-Deoxy-threo-pentonic acid, tetrakis-TMS
- Formula: C16H40O5Si4
- Molecular weight: 424.8278
- IUPAC Standard InChIKey: IEXXQBIANMZJJP-HUUCEWRRSA-N
- Chemical structure:
View 3d structure (requires JavaScript / HTML 5) - Stereoisomers:

Kovats' RI, non-polar column, isothermal

Column type | Active phase | Temperature (C) | I | Reference | Comment |
---|---|---|---|---|---|
Packed | OV-1 | 160. | 1697. | Petersson, 1977 | N2, Chromosorb G (100-120 mesh); Column length: 2. m |

References

Petersson, 1977
Petersson, G.,
Retention Data in GLC Analysis; Carbohydrate-Related Hydroxy Carboxylic and Dicarboxylic Acids as Trimethylsilyl Derivatives,
J. Chromatogr. Sci., 1977, 15, 7, 245-255, https://doi.org/10.1093/chromsci/15.7.245
. [all data]