propyl-δ1-tetrahydrocannabinolic acid, TMS
- Formula: C26H42O4Si2
- Molecular weight: 474.7803
- IUPAC Standard InChIKey: OFUYFPRFDQJVFM-UHFFFAOYSA-N
- Chemical structure:

Van Den Dool and Kratz RI, non-polar column, temperature ramp

Column type | Active phase | I | Reference | Comment |
---|---|---|---|---|
Packed | SE-30 | 2499. | Harvey, 1977 | N2, Gas Chrom Q, 4. K/min; Column length: 2. m; Tstart: 100. C; Tend: 330. C |

References

Harvey, 1977
Harvey, D.J.,
Cyclic alkylboronates as derivatives for the characterization of cannabinolic acids by combined gas chromatography and mass spectrometry,
Biomed. Mass Spectrom., 1977, 4, 2, 88-93, https://doi.org/10.1002/bms.1200040206
. [all data]