cannabidiolic acid, phenyl-boronate
- Formula: C28H33BO4
- Molecular weight: 444.370
- IUPAC Standard InChIKey: JJFDBRHKYHDRFR-PKTZIBPZSA-N
- Chemical structure:
View 3d structure (requires JavaScript / HTML 5) - Permanent link for this species. Use this link for bookmarking this species for future reference.

Van Den Dool and Kratz RI, non-polar column, temperature ramp

Column type | Active phase | I | Reference | Comment |
---|---|---|---|---|
Packed | SE-30 | 3189. | Harvey, 1977 | N2, Gas Chrom Q, 4. K/min; Column length: 2. m; Tstart: 100. C; Tend: 330. C |

References

Harvey, 1977
Harvey, D.J.,
Cyclic alkylboronates as derivatives for the characterization of cannabinolic acids by combined gas chromatography and mass spectrometry,
Biomed. Mass Spectrom., 1977, 4, 2, 88-93, https://doi.org/10.1002/bms.1200040206
. [all data]