Tetrahydrocannabinol, TMS
- Formula: C21H30O2
- Molecular weight: 314.4617
- IUPAC Standard InChIKey: CYQFCXCEBYINGO-IRXDYDNUSA-N
- Chemical structure:
View 3d structure (requires JavaScript / HTML 5) - Stereoisomers:

Kovats' RI, non-polar column, isothermal

Column type | Active phase | Temperature (C) | I | Reference | Comment |
---|---|---|---|---|---|
Packed | OV-1 | 260. | 2200. | Hoffman and Yang, 1972 | Chromosorb W (60-80 mesh); Column length: 2. m |

References

Hoffman and Yang, 1972
Hoffman, N.E.; Yang, R.K.,
Gas Chromatography of Δ1-Tetrahydrocannabinol,
Anal. Letters, 1972, 5, 1, 7-11, https://doi.org/10.1080/00032717208066082
. [all data]