5-heptadecene
- Formula: C17H34
- Molecular weight: 238.4519
- IUPAC Standard InChIKey: PEQVDTIKHXOELW-PKNBQFBNSA-N
- Chemical structure:
View 3d structure (requires JavaScript / HTML 5) - Species with the same structure:
- Stereoisomers:

Kovats' RI, non-polar column, temperature ramp

Column type | Active phase | I | Reference | Comment |
---|---|---|---|---|
Packed | Apiezon L | 1679. | Youngblood, Blumer, et al., 1971 | Chromosorb W, 4. K/min; Column length: 3.0 m; Tstart: 80. C; Tend: 290. C |

Kovats' RI, polar column, temperature ramp

Column type | Active phase | I | Reference | Comment |
---|---|---|---|---|
Packed | FFAP | 1733. | Youngblood, Blumer, et al., 1971 | Chromosorb W, 4. K/min; Column length: 3.0 m; Tstart: 80. C; Tend: 290. C |

Normal alkane RI, non-polar column, temperature ramp

Column type | Active phase | I | Reference | Comment |
---|---|---|---|---|
Capillary | SE-54 | 1691. | Scribe, Ngoumbi-Nzouzi, et al., 1990 | 2. K/min; Column length: 25. m; Column diameter: 0.32 mm; Tstart: 100. C; Tend: 280. C |

References

Youngblood, Blumer, et al., 1971
Youngblood, W.W.; Blumer, M.; Guillard, R.L.; Fiore, F.,
Saturated and unsaturated hydrocarbons in marine benthic algae,
Marine Biology, 1971, 8, 3, 190-201, https://doi.org/10.1007/BF00355215
. [all data]
Scribe, Ngoumbi-Nzouzi, et al., 1990
Scribe, P.; Ngoumbi-Nzouzi, J.-S.; Fuché, C.; Pèpe, C.; Saliot, A.,
Biogeochemistry of organic matter in Lake Geneva: I. Particulate hydrocarbons as biogenic and anthropogenic molecular markers,
Hydrobiologia, 1990, 207, 1, 319-331, https://doi.org/10.1007/BF00041471
. [all data]