Oxazole, 2-methyl-4-propyl
- Formula: C7H11NO
- Molecular weight: 125.1683
- IUPAC Standard InChIKey: RNLOKHYLXARFPN-UHFFFAOYSA-N
- Chemical structure:
View 3d structure (requires JavaScript / HTML 5) - Permanent link for this species. Use this link for bookmarking this species for future reference.

Kovats' RI, non-polar column, isothermal

Column type | Active phase | Temperature (C) | I | Reference | Comment |
---|---|---|---|---|---|
Capillary | OV-101 | 110. | 910. | Zhuravleva, Shenderyuk, et al., 1990 | 50. m/0.30 mm/0.40 μm, He |
Capillary | OV-101 | 110. | 910. | Golovnya, Shenderyuk, et al., 1989 | 40. m/0.28 mm/0.40 μm, He |

Kovats' RI, polar column, isothermal

Column type | Active phase | Temperature (C) | I | Reference | Comment |
---|---|---|---|---|---|
Capillary | PEG-40M | 110. | 1247. | Golovnya, Shenderyuk, et al., 1991 | He; Column length: 50. m; Column diameter: 0.30 mm |
Capillary | PEG-40M | 110. | 1247. | Zhuravleva, Shenderyuk, et al., 1990 | 50. m/0.30 mm/0.40 μm, He |

References

Zhuravleva, Shenderyuk, et al., 1990
Zhuravleva, I.L.; Shenderyuk, V.V.; Yakush, E.V.; Golovnya, R.V.,
Calculation of retention indexes of alkyloxazoles and alkylthiazoles in capillary chromatography,
Bull. Acad. Sci. USSR, Div. Chem. Sci. (Engl. Transl.), 1990, 6, 6, 1204-1210, https://doi.org/10.1007/BF00962384
. [all data]
Golovnya, Shenderyuk, et al., 1989
Golovnya, R.V.; Shenderyuk, V.V.; Zhuravleva, I.L.; Yakush, E.V.,
Use of a principle of non-additivity of sorption energies for calculation of retention indices of alkyloxazoles in capillary chromatography,
Zh. Anal. Khim., 1989, 44, 2037-2042. [all data]
Golovnya, Shenderyuk, et al., 1991
Golovnya, R.V.; Shenderyuk, V.V.; Zhuravleva, I.L.; Yakush, E.V.,
Analogy of sorption properties of alkylthiazoles and alkyl-oxazoles and its use for the calculation of retention indexes in capillary gas chromatography,
Zh. Anal. Khim., 1991, 46, 2, 313-319. [all data]