B-Sorbofuranose, TMS
- Formula: C21H52O6Si5
- Molecular weight: 541.0615
- IUPAC Standard InChIKey: PLNWQGWZBNJIQM-JSXRDJHFSA-N
- Chemical structure:
- Stereoisomers:
- A-Fructofuranose, TMS
- B-Fructofuranose, TMS
- α-Sorbose, TMS
- α-Allofuranose, TMS
- A-Psicofuranose, TMS
- A-Sorbofuranose, TMS
- A-Tagatofuranose, TMS
- B-Psicofuranose, TMS
- B-Tagatofuranose, TMS
- α-Mannofuranose, TMS
- α-Talofuranose, TMS
- β-Talofuranose, TMS
- Fructofuranose, penta-TMS
- D-(-)-Tagatofuranose, pentakis(trimethylsilyl) ether (isomer 1)
- D-(-)-Tagatofuranose, pentakis(trimethylsilyl) ether (isomer 2)
- D-Psicofuranose, pentakis(trimethylsilyl) ether (isomer 1)
- D-Psicofuranose, pentakis(trimethylsilyl) ether (isomer 2)
- L-(-)-Sorbofuranose, pentakis(trimethylsilyl) ether
- D-(-)-Fructofuranose, pentakis(trimethylsilyl) ether (isomer 1)
- D-(-)-Fructofuranose, pentakis(trimethylsilyl) ether (isomer 2)
- Other names: β-Sorbose, TMS; L(-)-Sorbose, furanose, TMS

Kovats' RI, non-polar column, isothermal

Column type | Active phase | Temperature (C) | I | Reference | Comment |
---|---|---|---|---|---|
Capillary | OV-1 | 180. | 1846. | Garcia-Raso, Fernandez-Diaz, et al., 1989 | Column length: 25. m; Column diameter: 0.22 mm |

Kovats' RI, non-polar column, temperature ramp

Column type | Active phase | I | Reference | Comment |
---|---|---|---|---|
Capillary | DB-5MS | 1822. | Medeiros and Simoneit, 2007 | 30. m/0.25 mm/0.25 μm, He, 65. C @ 2. min, 6. K/min, 300. C @ 15. min |

Kovats' RI, polar column, isothermal

Column type | Active phase | Temperature (C) | I | Reference | Comment |
---|---|---|---|---|---|
Capillary | FFAP | 170. | 1696. | Garcia-Raso, Fernandez-Diaz, et al., 1989 | Column length: 24. m; Column diameter: 0.22 mm |

References

Garcia-Raso, Fernandez-Diaz, et al., 1989
Garcia-Raso, A.; Fernandez-Diaz, M.; Paez, M.I.; Sanz, J.; Martinez-Castro, I.,
Gas Chromatographic Retention of Carbohydrate Trimethylsilyl Ethers. III. Ketohexoses,
J. Chromatogr., 1989, 471, 205-216, https://doi.org/10.1016/S0021-9673(00)94168-2
. [all data]
Medeiros and Simoneit, 2007
Medeiros, P.M.; Simoneit, B.R.T.,
Analysis of sugars in environmental samples by gas chromatography-mass spectrometry,
J. Chromatogr. A, 2007, 1141, 2, 271-278, https://doi.org/10.1016/j.chroma.2006.12.017
. [all data]