1,2,5,7-Tetramethylnaphthalene

Lee's RI, non-polar column, temperature ramp

View large format table.

Column type Active phase I Reference Comment
CapillaryDB-5MS288.40Sun, Zhou, et al., 200830. m/0.25 mm/0.25 μm, 50. C @ 2. min, 6. K/min, 300. C @ 16. min
CapillaryDB-5286.80Forster, Alexander, et al., 1989H2, 2. K/min, 300. C @ 10. min; Column length: 60. m; Column diameter: 0.20 mm; Tstart: 70. C

References

Sun, Zhou, et al., 2008
Sun, P.; Zhou, Q.; Li, G.; Wang, X.; Zhao, Y.; Cao, L., fingerprint analysis of polycyclic aromatic hydrocarbons in crude oil by internal standard method, J. Instrumental Anal., 2008, 27, 4, 344-348. [all data]

Forster, Alexander, et al., 1989
Forster, P.G.; Alexander, R.; Kagi, R.I., Identification and analysis of tetramethylnaphthalenes in petroleum, J. Chromatogr., 1989, 483, 384-389, https://doi.org/10.1016/S0021-9673(01)93138-3 . [all data]