cis-3,5-dimethyl-1,2,4-trithiolane

Kovats' RI, non-polar column, isothermal

View large format table.

Column type Active phase Temperature (C) I Reference Comment
PackedApiezon M130.1181.Garbuzov, Misharina, et al., 1985He or N2, Chromosorb W, AW-DMCS; Column length: 2.1 m

Van Den Dool and Kratz RI, non-polar column, temperature ramp

View large format table.

Column type Active phase I Reference Comment
CapillaryCP Sil 8 CB1127.Mahadevan and Farmer, 200660. C @ 5. min, 4. K/min, 220. C @ 30. min; Column length: 50. m; Column diameter: 0.32 mm
CapillaryBPX-51169.Bredie, Mottram, et al., 200250. m/0.32 mm/0.5 μm, 60. C @ 5. min, 4. K/min, 250. C @ 20. min
CapillaryBPX-51177.Bredie, Mottram, et al., 200250. m/0.32 mm/0.5 μm, 60. C @ 5. min, 4. K/min, 250. C @ 20. min
CapillaryBP-51144.Whitfield and Mottram, 20014. K/min; Column length: 50. m; Column diameter: 0.32 mm; Tstart: 60. C; Tend: 250. C
CapillaryDB-51151.Madruga and Mottram, 199830. m/0.32 mm/1. μm, 60. C @ 5. min, 4. K/min, 250. C @ 20. min
CapillaryDB-11110.Zhang and Ho, 199160. m/0.25 mm/0.25 μm, He, 2. K/min, 220. C @ 10. min; Tstart: 40. C
CapillaryDB-11107.Zhang and Ho, 1991, 260. m/0.25 mm/0.25 μm, He, 2. K/min, 220. C @ 10. min; Tstart: 40. C
CapillaryDB-11106.Zhang and Ho, 198960. m/0.25 mm/0.25 μm, He, 2. K/min, 220. C @ 10. min; Tstart: 40. C
CapillaryDB-11108.Zhang, Chien, et al., 198860. m/0.25 mm/0.25 μm, He, 2. K/min, 220. C @ 10. min; Tstart: 40. C

Van Den Dool and Kratz RI, polar column, temperature ramp

View large format table.

Column type Active phase I Reference Comment
CapillaryCP-Wax 52CB1578.Mahadevan and Farmer, 200660. C @ 5. min, 4. K/min, 220. C @ 30. min; Column length: 50. m; Column diameter: 0.32 mm
CapillaryCP-Wax 52CB1586.Mahadevan and Farmer, 200660. C @ 5. min, 4. K/min, 220. C @ 30. min; Column length: 50. m; Column diameter: 0.32 mm

Van Den Dool and Kratz RI, polar column, custom temperature program

View large format table.

Column type Active phase I Reference Comment
CapillaryCP-Wax 52CB1603.Madruga and Mottram, 199850. m/0.32 mm/0.21 μm; Program: 0C(5min) => fast => 60C(5min) => 4C/min => 220C(20min)

Normal alkane RI, non-polar column, temperature ramp

View large format table.

Column type Active phase I Reference Comment
CapillaryDB-51154.Macku and Shibamoto, 1991He, 40. C @ 5. min, 2. K/min; Column length: 60. m; Column diameter: 0.25 mm; Tend: 160. C

Normal alkane RI, polar column, temperature ramp

View large format table.

Column type Active phase I Reference Comment
CapillaryPEG-20M1588.Kubota, Nakamoto, et al., 1991N2, 2. K/min; Column length: 50. m; Column diameter: 0.25 mm; Tstart: 60. C; Tend: 180. C

References

Garbuzov, Misharina, et al., 1985
Garbuzov, V.G.; Misharina, T.A.; Aerov, A.F.; Golovnya, R.V., Gas chromatographic retention indices for sulphur(II)-containing organic substances, J. Anal. Chem. USSR (Engl. Transl.), 1985, 40, 4, 576-586. [all data]

Mahadevan and Farmer, 2006
Mahadevan, K.; Farmer, L., Key Odor Impact Compounds in Three Yeast Extract Pastes, J. Agric. Food Chem., 2006, 54, 19, 7242-7250, https://doi.org/10.1021/jf061102x . [all data]

Bredie, Mottram, et al., 2002
Bredie, W.L.P.; Mottram, D.S.; Guy, R.C.E., Effect of temperature and pH on the generation of flavor volatiles in extrusion cooking of wheat flour, J. Agric. Food Chem., 2002, 50, 5, 1118-1125, https://doi.org/10.1021/jf0111662 . [all data]

Whitfield and Mottram, 2001
Whitfield, F.B.; Mottram, D.S., Heterocyclic volatiles formed by heating cysteine or hydrogen sulfide with 4-hydroxy-5-methyl-3(2H)-furanone at pH 6.5, J. Agric. Food Chem., 2001, 49, 2, 816-822, https://doi.org/10.1021/jf0008644 . [all data]

Madruga and Mottram, 1998
Madruga, M.S.; Mottram, D.S., The effect of pH on the formation of volatile compounds produced by heating a model system containing 5'-imp and cysteine, J. Braz. Chem. Soc., 1998, 9, 3, 261-271, https://doi.org/10.1590/S0103-50531998000300010 . [all data]

Zhang and Ho, 1991
Zhang, Y.; Ho, C.-T., Formation of meatlike aroma compounds from thermal reaction of inosine 5'-monophosphate with cysteine and glutathione, J. Agric. Food Chem., 1991, 39, 6, 1145-1148, https://doi.org/10.1021/jf00006a031 . [all data]

Zhang and Ho, 1991, 2
Zhang, Y.; Ho, C.-T., Comparison of the volatile compounds formed from the thermal reaction of glucose with cysteine and glutathione, J. Agric. Food Chem., 1991, 39, 4, 760-763, https://doi.org/10.1021/jf00004a029 . [all data]

Zhang and Ho, 1989
Zhang, Y.; Ho, C.-T., Volatile compounds formed from thermnal interaction of 2,4-decadienal with cysteine and glutathione, J. Agric. Food Chem., 1989, 37, 4, 1016-1020, https://doi.org/10.1021/jf00088a044 . [all data]

Zhang, Chien, et al., 1988
Zhang, Y.; Chien, M.; Ho.C.-T., Comparison of the volatile compounds obtained from thermal degradation of cysteine and glutathione in water, J. Agric. Food Chem., 1988, 36, 5, 992-996, https://doi.org/10.1021/jf00083a022 . [all data]

Macku and Shibamoto, 1991
Macku, C.; Shibamoto, T., Volatile sulfur-containing compounds generated from the thermal interaction of corn oil and cysteine, J. Agric. Food Chem., 1991, 39, 11, 1987-1989, https://doi.org/10.1021/jf00011a021 . [all data]

Kubota, Nakamoto, et al., 1991
Kubota, K.; Nakamoto, A.; Moriguchi, M.; Kobayashi, A.; Ishii, H., Formation of pyrrolidino[1,2-e]-4H-2,4-dimethyl-1,3,5-dithiazine in the volatiles of boiled short-necked clam, clam, and corbicula, J. Agric. Food Chem., 1991, 39, 6, 1127-1130, https://doi.org/10.1021/jf00006a027 . [all data]