Adamantane-2,6-dione

Kovats' RI, non-polar column, isothermal

View large format table.

Column type Active phase Temperature (C) I Reference Comment
CapillaryOV-101200.1490.Suslov, Rudenko, et al., 1988N2; Column length: 50. m; Column diameter: 0.25 mm

Normal alkane RI, non-polar column, isothermal

View large format table.

Column type Active phase Temperature (C) I Reference Comment
CapillaryOV-101200.1498.Triska and Vodicka, 1991Column length: 50. m; Column diameter: 0.25 mm
CapillaryOV-101210.1509.Triska and Vodicka, 1991Column length: 50. m; Column diameter: 0.25 mm
CapillaryOV-101220.1513.Triska and Vodicka, 1991Column length: 50. m; Column diameter: 0.25 mm
CapillaryOV-101200.1498.Vodicka, Triska, et al., 1986Nitrogen; Column length: 50. m; Column diameter: 0.25 mm
CapillaryOV-101210.1509.Vodicka, Triska, et al., 1986Nitrogen; Column length: 50. m; Column diameter: 0.25 mm

References

Suslov, Rudenko, et al., 1988
Suslov, I.A.; Rudenko, B.A.; Arzamastsev, A.P., Capillary chromatography of adamantane derivatives, Zh. Anal. Khim., 1988, 43, 328-332. [all data]

Triska and Vodicka, 1991
Triska, J.; Vodicka, L., Characterization of ditopic oxygen-containing adamantane derivatives by capillary gas chromatography and thin-layer chromatography, Sbornik Vysoke Skoly Chemisco-Techlogicke v Praze, 1991, D59, 91-100. [all data]

Vodicka, Triska, et al., 1986
Vodicka, L.; Triska, J.; Hlavaty, J., Characterization of oxygen-containing qdqmqntane derivatives by parillary gas chromatography, J. Chromatogr., 1986, 366, 382-384, https://doi.org/10.1016/S0021-9673(01)93487-9 . [all data]