1-Adamantanol, acetate
- Formula: C12H18O2
- Molecular weight: 194.2701
- IUPAC Standard InChIKey: ZYLRDAOEBRPIGT-UHFFFAOYSA-N
- Chemical structure:
View 3d structure (requires JavaScript / HTML 5) - Species with the same structure:

Kovats' RI, non-polar column, isothermal

Column type | Active phase | Temperature (C) | I | Reference | Comment |
---|---|---|---|---|---|
Capillary | OV-101 | 200. | 1458. | Suslov, Rudenko, et al., 1988 | N2; Column length: 50. m; Column diameter: 0.25 mm |

References

Suslov, Rudenko, et al., 1988
Suslov, I.A.; Rudenko, B.A.; Arzamastsev, A.P.,
Capillary chromatography of adamantane derivatives,
Zh. Anal. Khim., 1988, 43, 328-332. [all data]