GLUCURONIC ACID 5TMS-1
- Formula: C21H50O7Si5
- Molecular weight: 555.0450
- IUPAC Standard InChIKey: HDGFBGPNRURMOV-YRPNKDGESA-N
- Chemical structure:
View 3d structure (requires JavaScript / HTML 5) - Stereoisomers:
- Other names: GLUCURONIC ACID 5TMS-2

Van Den Dool and Kratz RI, non-polar column, temperature ramp

Column type | Active phase | I | Reference | Comment |
---|---|---|---|---|
Capillary | DB-5MS | 1928. | Umeå Plant Science Centre, 2006 | 15. m/0.18 mm/0.18 μm, 70. C @ 2. min, 40. K/min, 320. C @ 1. min |
Capillary | DB-5MS | 1942. | Umeå Plant Science Centre, 2006 | 15. m/0.18 mm/0.18 μm, 70. C @ 2. min, 40. K/min, 320. C @ 1. min |

References

Umeå Plant Science Centre, 2006
Umeå Plant Science Centre, The Metabolomics facility,
RTI data. Compound identification, 2006, retrieved from http://www.upsc.se/metabolomics.htm. [all data]