Fructose, MO-TMS, II

Normal alkane RI, non-polar column, isothermal

View large format table.

Column type Active phase Temperature (C) I Reference Comment
CapillaryOV-101175.1935.Zegota, 1980Column length: 50. m; Column diameter: 0.30 mm
CapillarySE-30165.1950.Zegota, 198035; Column diameter: 0.30 mm

References

Zegota, 1980
Zegota, H., Separation and quantitative determination of fructose as the O-methyloxime by gas-liquid chromatography using glass capillary columns, J. Chromatogr., 1980, 192, 2, 446-451, https://doi.org/10.1016/S0021-9673(80)80024-0 . [all data]