trans-Cubebol
- Formula: C15H26O
- Molecular weight: 222.3663
- IUPAC Standard InChIKey: KONGRWVLXLWGDV-BYGOPZEFSA-N
- Chemical structure:
View 3d structure (requires JavaScript / HTML 5) - Stereoisomers:

Kovats' RI, non-polar column, temperature ramp

Column type | Active phase | I | Reference | Comment |
---|---|---|---|---|
Capillary | CP Sil 8 CB | 1511. | Tayoub, Schwob, et al., 2006 | 30. m/0.25 mm/0.25 μm, H2, 50. C @ 2. min, 3. K/min; Tend: 220. C |

Normal alkane RI, non-polar column, custom temperature program

Column type | Active phase | I | Reference | Comment |
---|---|---|---|---|
Capillary | DB-5 | 1514. | Courtois, Paine, et al., 2009 | 30. m/0.25 mm/0.25 μm, Helium; Program: 50 0C m6 0C/min -> 140 0C 5 0C/min -> 160 0C (1 min) 10 0C/min -> 200 0C |

References

Tayoub, Schwob, et al., 2006
Tayoub, G.; Schwob, I.; Bessiere, J.-M.; Masotti, V.; Rabier, J.; Ruzzier, M.; Viano, J.,
Composition of volatile oils of Styrax (Styrax officinalis L.) leaves at different phenological stages,
Biochem. Syst. Ecol., 2006, 34, 9, 705-709, https://doi.org/10.1016/j.bse.2006.05.008
. [all data]
Courtois, Paine, et al., 2009
Courtois, E.A.; Paine, C.E.; Blandinieres, P.-A.; Stien, D.; Bessiere, J.-M.; Houel, E.; Baraloto, C.; Chave, J.,
Diversity of the volatile organic compounds emitted by 55 species of tropical trees: a survey in French Guiana,
J. Chem. Ecol., 2009, 35, 11, 1349-1362, https://doi.org/10.1007/s10886-009-9718-1
. [all data]