ethyl hexacosanoate
- Formula: C28H56O2
- Molecular weight: 424.7430
- IUPAC Standard InChIKey: VFWXXMBQXSOLQQ-UHFFFAOYSA-N
- Chemical structure:
View 3d structure (requires JavaScript / HTML 5) - Species with the same structure:

Normal alkane RI, non-polar column, temperature ramp

Column type | Active phase | I | Reference | Comment |
---|---|---|---|---|
Capillary | DB-1MS | 2980.88 | Stransky, Zarevucka, et al., 2006 | 30. m/0.252 mm/0.25 μm, H2, 1. K/min; Tstart: 240. C; Tend: 340. C |

References

Stransky, Zarevucka, et al., 2006
Stransky, K.; Zarevucka, M.; Valterova, I.; Wimmer, Z.,
Gas chromatographic retention data of wax esters,
J. Chromatogr. A, 2006, 1128, 1-2, 208-219, https://doi.org/10.1016/j.chroma.2006.06.035
. [all data]