Calamenen-3,5(10)-diene
- Formula: C15H24
- Molecular weight: 204.3511
- IUPAC Standard InChIKey: ULTBCADWJVQRCF-OLZOCXBDSA-N
- Chemical structure:
View 3d structure (requires JavaScript / HTML 5) - Species with the same structure:
- Stereoisomers:

Normal alkane RI, non-polar column, temperature ramp

Column type | Active phase | I | Reference | Comment |
---|---|---|---|---|
Capillary | SPB-5 | 1524. | Stojanovic, Palic, et al., 2006 | He, 50. C @ 3. min, 5. K/min, 250. C @ 15. min |

References

Stojanovic, Palic, et al., 2006
Stojanovic, G.; Palic, I.; Ursic-Jankovic, J.,
Composition and antimicrobial activity of the essential oil of Micromeria cristata and Micromeria juliana,
Flavour Fragr. J., 2006, 21, 1, 77-79, https://doi.org/10.1002/ffj.1507
. [all data]