epi- α-Muurolene
- Formula: C15H24
- Molecular weight: 204.3511
- IUPAC Standard InChIKey: QMAYBMKBYCGXDH-SOUVJXGZSA-N
- Chemical structure:
View 3d structure (requires JavaScript / HTML 5) - Species with the same structure:
- Stereoisomers:
- α-Muurolene
- (1R,4aS,8aR)-1-Isopropyl-4,7-dimethyl-1,2,4a,5,6,8a-hexahydronaphthalene
- Naphthalene, 1,2,4a,5,6,8a-hexahydro-4,7-dimethyl-1-(1-methylethyl)-, [1S-(1α,4aβ,8aα)]-
- α-Muurolene
- Naphthalene, 1,2,4a,5,6,8a-hexahydro-4,7-dimethyl-1-(1-methylethyl)-
- 7-epi-α-Cadinene
- Muurola-4,9-diene
- +α-Amorphene
- Zizanene

Normal alkane RI, non-polar column, temperature ramp

Column type | Active phase | I | Reference | Comment |
---|---|---|---|---|
Capillary | DB-5 | 1644. | Morteza-Semnani, Saeedi, et al., 2007 | 30. m/0.25 mm/0.25 μm, Helium, 4. K/min; Tstart: 60. C; Tend: 220. C |

References

Morteza-Semnani, Saeedi, et al., 2007
Morteza-Semnani, K.; Saeedi, M.; Akbarzadeh, M.,
Essential oil composition of Teucrium scordium L.,
Acta Pharm., 2007, 57, 4, 499-504, https://doi.org/10.2478/v10007-007-0040-6
. [all data]