Bicyclo[7.2.0]undec-4-ene, 4,11,11-trimethyl-8-methylene-deriv.
- Formula: C15H24
- Molecular weight: 204.3511
- IUPAC Standard InChIKey: NPNUFJAVOOONJE-IOMPXFEGSA-N
- Chemical structure:
View 3d structure (requires JavaScript / HTML 5) - Species with the same structure:
- Stereoisomers:
- Bicyclo[7.2.0]undec-4-ene, 4,11,11-trimethyl-8-methylene-,[1R-(1R*,4Z,9S*)]-
- Bicyclo[7.2.0]undec-4-ene, 4,11,11-trimethyl-8-methylene-
- (1R,9R,E)-4,11,11-Trimethyl-8-methylenebicyclo[7.2.0]undec-4-ene
- 9-epi-Caryophyllene
- cis-Caryophyllene
- (+)(E)-Caryophyllene
- 2-epi-(E)- β-Caryophyllene
- 9-epi-β-Caryophyllene
- cis-Caryophyllene
- 2-epi-(E)-β-Caryophyllene
- β-cis-Caryophyllene
- Isocaryophyllene

Kovats' RI, non-polar column, custom temperature program

Column type | Active phase | I | Reference | Comment |
---|---|---|---|---|
Capillary | HP-5MS | 1468. | Mevy, Bousquet-Melou, et al., 2006 | 30. m/0.25 mm/0.25 μm, He; Program: 50C(2min) => 2C/min => 160C(5min) => 50C/min => 270C (6min) |
Capillary | HP-5MS | 1468. | Mevy, Bousquet-Melou, et al., 2006 | 30. m/0.25 mm/0.25 μm, He; Program: 50C(2min) => 2C/min => 160C(5min) => 50C/min => 270C (6min) |

References

Mevy, Bousquet-Melou, et al., 2006
Mevy, J.P.; Bousquet-Melou, A.; Greff, S.; Millogo, J.; Fernandez, C.,
Chemical composition of the volatile oil of Laggera aurita Schulz from Burkina-Faso,
Biochem. Syst. Ecol., 2006, 34, 11, 815-818, https://doi.org/10.1016/j.bse.2006.06.005
. [all data]