α-Cyperene
- Formula: C15H24
- Molecular weight: 204.3511
- IUPAC Standard InChIKey: RTBLDXVIGWSICW-JMSVASOKSA-N
- Chemical structure:
View 3d structure (requires JavaScript / HTML 5) - Stereoisomers:

Normal alkane RI, non-polar column, custom temperature program

Column type | Active phase | I | Reference | Comment |
---|---|---|---|---|
Capillary | DB-5 | 1350. | Massardo, Senatore, et al., 2006 | 30. m/0.25 mm/0.25 μm, He; Program: 40C (5min) => 2C/min => 250C(15min) => 5C/min => 270C (10min) |

References

Massardo, Senatore, et al., 2006
Massardo, D.R.; Senatore, F.; Alifano, P.; del Giudice, L.; Pontieri, P.,
Vetiver oil production correlates with early root growth,
Biochem. Syst. Ecol., 2006, 34, 5, 376-382, https://doi.org/10.1016/j.bse.2005.10.016
. [all data]