Germacradien-4-ol
- Formula: C15H26O
- Molecular weight: 222.3663
- IUPAC Standard InChIKey: RHCTXHCNRLCYBN-GWVGWQBCSA-N
- Chemical structure:
View 3d structure (requires JavaScript / HTML 5) - Species with the same structure:
- Stereoisomers:

Normal alkane RI, non-polar column, temperature ramp

Column type | Active phase | I | Reference | Comment |
---|---|---|---|---|
Capillary | HP-5 | 1579. | Farsam, Amanlou, et al., 2007 | 30. m/0.25 mm/0.26 μm, Helium, 60. C @ 2. min, 4. K/min, 240. C @ 20. min |
Capillary | HP-5 | 1574. | Lago, Soares, et al., 2006 | 30. m/0.25 mm/0.25 μm, He, 100. C @ 2. min, 5. K/min, 240. C @ 5. min |

References

Farsam, Amanlou, et al., 2007
Farsam, H.; Amanlou, M.; Taghi-Cheetsaz, N.; Amin, G.R.; Saledi-Sormaghi, M.H.,
Essential Oil of Chimonanthus fragrans flowers Population of Tehran,
DARU, 2007, 15, 3, 129-131. [all data]
Lago, Soares, et al., 2006
Lago, J.H.G.; Soares, M.G.; Batista-Pereira, L.G.; Silva, M.F.G.F.; Corrêa, A.G.; Fernandes, J.B.; Vieira, P.C.; Roque, N.F.,
Volatile oil from Guarea macrophylla ssp. tuberculata: seasonal variation and electroantennographic detection by Hypsipyla grandella,
Phytochemistry, 2006, 67, 6, 589-594, https://doi.org/10.1016/j.phytochem.2005.12.018
. [all data]