p-menth-1-en-3-[2-methyl-1,3-butadienyl]-8-ol
- Formula: C15H24O
- Molecular weight: 220.3505
- IUPAC Standard InChIKey: DVYSNYGZMYYMJK-PKNBQFBNSA-N
- Chemical structure:

Normal alkane RI, polar column, custom temperature program

Column type | Active phase | I | Reference | Comment |
---|---|---|---|---|
Capillary | Carbowax 20M | 2110. | Krings U., Hardebusch B., et al., 2006 | 30. m/0.32 mm/0.25 μm; Program: 100C(2min) => 5C/min => 160C => 3C/min => 230C(5min) |
Capillary | Carbowax 20M | 2150. | Krings U., Hardebusch B., et al., 2006 | 30. m/0.32 mm/0.25 μm; Program: 100C(2min) => 5C/min => 160C => 3C/min => 230C(5min) |

References

Krings U., Hardebusch B., et al., 2006
Krings U.; Hardebusch B.; Albert D.; Berger R.G.; Marostica M.Jr.; Pastore G.M.,
Odor-active alcohols from the fungal transformation of alpha-farnesene,
J. Agric. Food Chem., 2006, 54, 24, 9079-9084, https://doi.org/10.1021/jf062089j
. [all data]