(Z)-3-Hexene, 2,2-dimethyl
- Formula: C9H18
- Molecular weight: 126.2392
- IUPAC Standard InChIKey: BQOCYCICSYUPRF-FPLPWBNLSA-N
- Chemical structure:
View 3d structure (requires JavaScript / HTML 5) - Stereoisomers:

Kovats' RI, non-polar column, isothermal

Column type | Active phase | Temperature (C) | I | Reference | Comment |
---|---|---|---|---|---|
Capillary | OV-101 | 40. | 723. | Laub and Purnell, 1988 | |
Capillary | OV-101 | 60. | 724. | Laub and Purnell, 1988 | |
Capillary | OV-101 | 80. | 726. | Laub and Purnell, 1988 |

References

Laub and Purnell, 1988
Laub, R.J.; Purnell, J.H.,
Specific retention volumes, retention indices, and family-plot regressions of aliphatic, alicyclic, and aromatic hydrocarbon solutes with OV-101 poly (dimethylsiloxane) stationary phase,
J. Hi. Res. Chromatogr. Chromatogr. Comm., 1988, 11, 9, 649-660, https://doi.org/10.1002/jhrc.1240110908
. [all data]