4-epi-Marsupellol
- Formula: C14H22O
- Molecular weight: 206.3239
- IUPAC Standard InChIKey: BYWVWPAVZNWJQI-CZKGIMFJSA-N
- Chemical structure:
View 3d structure (requires JavaScript / HTML 5) - Permanent link for this species. Use this link for bookmarking this species for future reference.

Normal alkane RI, non-polar column, temperature ramp

Column type | Active phase | I | Reference | Comment |
---|---|---|---|---|
Capillary | CP Sil 5 CB | 1614. | Adio, 2005 | H2, 3. K/min; Column length: 25. m; Tstart: 50. C; Tend: 230. C |

References

Adio, 2005
Adio, A.M.,
Isolation and structure elucidation of sesquiterpenoids from the essential oils of some liverworths (Hepaticae), Dissertation, Hamburg University, 2005, 265. [all data]