2(2,2,2-trifluoroethyl)-amino--5-chloro-benzophenone (TCB)
- Formula: C15H11ClF3NO
- Molecular weight: 313.702
- IUPAC Standard InChIKey: MKBQTVZIYPYTSC-UHFFFAOYSA-N
- Chemical structure:
View 3d structure (requires JavaScript / HTML 5) - Other names: 2-(2,2,2-Trifluoroethylamino)-5-chlorobenzophenone

Kovats' RI, non-polar column, isothermal

Column type | Active phase | Temperature (C) | I | Reference | Comment |
---|---|---|---|---|---|
Capillary | HP-1 | 200. | 1968. | Japp, Garthwaite, et al., 1988 | 30. m/0.53 mm/0.88 μm, N2 |
Capillary | BP-1 | 200. | 1975. | Japp, Garthwaite, et al., 1988 | 25. m/0.22 mm/0.25 μm, N2 |

Kovats' RI, non-polar column, custom temperature program

Column type | Active phase | I | Reference | Comment |
---|---|---|---|---|
Capillary | OV-1 | 2000. | Schütz, 1988 | Program: not specified |

References

Japp, Garthwaite, et al., 1988
Japp, M.; Garthwaite, K.; Geeson, A.V.; Osselton, M.D.,
Collection of Analytical Data for Benzodiazepines and Benzophenones,
J. Chromatogr., 1988, 439, 2, 317-339, https://doi.org/10.1016/S0021-9673(01)83844-9
. [all data]
Schütz, 1988
Schütz, H.,
Modern screening strategies in analytical toxicology with special regard to new benzodiazepines,
Z. Rechtsmed., 1988, 100, 1, 19-37, https://doi.org/10.1007/BF00200362
. [all data]