(-)-Kaur-16-en-19-al

Normal alkane RI, non-polar column, temperature ramp

View large format table.

Column type Active phase I Reference Comment
CapillaryHP-52330.Ibañez and Usubillaga, 200630. m/0.25 mm/0.25 μm, He, 4. K/min; Tstart: 60. C; Tend: 240. C
CapillaryHP-5MS2330.Ibanez and Usubillaga, 200630. m/0.25 mm/0.25 μm, He, 4. K/min; Tstart: 60. C; Tend: 260. C

References

Ibañez and Usubillaga, 2006
Ibañez, J.; Usubillaga, A., The essential oil of Espeletia schultzii of different altitudinal populations, Flavour Fragr. J., 2006, 21, 2, 286-289, https://doi.org/10.1002/ffj.1586 . [all data]

Ibanez and Usubillaga, 2006
Ibanez, J.; Usubillaga, A., Analysis of the essential oil of two different altitudinal populations of Coespeletia moritziana (Sch. Bip.ex Wedd) Cuatrec, Flavour Fragr. J., 2006, 21, 5, 760-763, https://doi.org/10.1002/ffj.1655 . [all data]