D-Neomenthyl-D-lactate

Normal alkane RI, non-polar column, temperature ramp

View large format table.

Column type Active phase I Reference Comment
CapillaryDB-11434.Gassenmeier, 200660. m/0.32 mm/1. μm, He, 35. C @ 2. min, 4. K/min, 300. C @ 10. min

Normal alkane RI, polar column, temperature ramp

View large format table.

Column type Active phase I Reference Comment
CapillaryDB-Wax1955.Gassenmeier, 200630. m/0.25 mm/0.25 μm, He, 35. C @ 2. min, 4. K/min, 250. C @ 10. min

References

Gassenmeier, 2006
Gassenmeier, K., Identification and quantification of L-menthyl lactate in essential oils from Mentha arvensis L. from India and model studies on the formation of L-menthyl lactate during essential oil production, Flavour Fragr. J., 2006, 21, 4, 725-730, https://doi.org/10.1002/ffj.1719 . [all data]