3,7-Dimethyl-2,6-octadien-1-ol
- Formula: C10H18O
- Molecular weight: 154.2493
- IUPAC Standard InChIKey: GLZPCOQZEFWAFX-JXMROGBWSA-N
- Chemical structure:
View 3d structure (requires JavaScript / HTML 5) - Species with the same structure:
- Stereoisomers:

Van Den Dool and Kratz RI, non-polar column, temperature ramp

Column type | Active phase | I | Reference | Comment |
---|---|---|---|---|
Capillary | HP-5MS | 1253.1 | Zhao, Liang, et al., 2005 | 30. m/0.25 mm/0.25 μm, He, 2. K/min; Tstart: 80. C; Tend: 290. C |
Capillary | HP-5MS | 1253.2 | Zhao, Liang, et al., 2005 | 30. m/0.25 mm/0.25 μm, He, 4. K/min; Tstart: 80. C; Tend: 290. C |
Capillary | HP-5MS | 1252.9 | Zhao, Liang, et al., 2005 | 30. m/0.25 mm/0.25 μm, He, 6. K/min; Tstart: 80. C; Tend: 290. C |

References

Zhao, Liang, et al., 2005
Zhao, C.-X.; Liang, Y.-Z.; Fang, H.-Z.; Li, X.-N.,
Temperature-programmed retention indices for gas chromatography-mass spectroscopy analysis of plant essential oils,
J. Chromatogr. A, 2005, 1096, 1-2, 76-85, https://doi.org/10.1016/j.chroma.2005.09.067
. [all data]