(E)-1-propenyl sec-butyl disulfide

Normal alkane RI, non-polar column, temperature ramp

View large format table.

Column type Active phase I Reference Comment
CapillaryDB-11181.Khajeh, Yamini, et al., 200560. m/0.25 mm/0.25 μm, He, 50. C @ 5. min, 4. K/min; Tend: 250. C

References

Khajeh, Yamini, et al., 2005
Khajeh, M.; Yamini, Y.; Bahramifar, N.; Sefidkon, F.; Reza Pirmoradei, M., Comparison of essential oils compositions of Ferula assa-foetida obtained by supercritical carbon dioxide extraction and hydrodistillation methods, Food Chem., 2005, 91, 4, 639-644, https://doi.org/10.1016/j.foodchem.2004.06.033 . [all data]