2,15-Diacetoxyheptadecane

Van Den Dool and Kratz RI, non-polar column, temperature ramp

Data compiled by: NIST Mass Spectrometry Data Center, William E. Wallace, director

Column type Capillary
Active phase DB-5
Column length (m)
Carrier gas
Substrate
Column diameter (mm)
Phase thickness (μm)
Tstart (C) 100.
Tend (C) 280.
Heat rate (K/min) 15.
Initial hold (min) 1.
Final hold (min)
I 2314.
ReferenceGries R., Khaskin G., et al., 2005
Comment MSDC-RI

References

Gries R., Khaskin G., et al., 2005
Gries R.; Khaskin G.; Bennett R.G.; Miroshnychenko A.; Burden K.; Gries G., (S,S)-2,12-, (S,S)-2,13-, and (S,S)-2,14-diacetoxyheptadecanes: Sex pheromone components of red cedar cone midge, Mayetiola thujae, J. Chem. Ecol., 2005, 31, 12, 2933-2946, https://doi.org/10.1007/s10886-005-8405-0 . [all data]