(E)-2-Hexyl-cinnamaldehyde
- Formula: C15H20O
- Molecular weight: 216.3187
- IUPAC Standard InChIKey: GUUHFMWKWLOQMM-NTCAYCPXSA-N
- Chemical structure:
View 3d structure (requires JavaScript / HTML 5) - Stereoisomers:
- Other names: 2-Hexyl-(E)-cinnamaldehyde

Van Den Dool and Kratz RI, non-polar column, custom temperature program

Column type | Active phase | I | Reference | Comment |
---|---|---|---|---|
Capillary | BPX-5 | 1754. | Mondello, Casilli, et al., 2005 | 30. m/0.25 mm/0.25 μm, He; Program: 50C => 1.5C/min => 230C => 15C/min => 260C |

Normal alkane RI, non-polar column, custom temperature program

Column type | Active phase | I | Reference | Comment |
---|---|---|---|---|
Capillary | HP-5MS | 1749. | Alissandrakis, Kibaris, et al., 2005 | 30. m/0.25 mm/0.25 μm, He; Program: 40C(3min) => 2C/min => 180C => 10C/min => 250C(5min) |

References

Mondello, Casilli, et al., 2005
Mondello, L.; Casilli, A.; Tranchida, P.Q.; Dugo, G.; Dugo, P.,
Comprehensive two-dimensional gas chromatography in combination with rapid scanning quadrupole mass spectrometry in perfume analysis,
J. Chromatogr. A, 2005, 1067, 1-2, 235-243, https://doi.org/10.1016/j.chroma.2004.09.040
. [all data]
Alissandrakis, Kibaris, et al., 2005
Alissandrakis, E.; Kibaris, A.C.; Tarantilis, P.A.; Harizanis, P.C.; Polissiou, M.,
Flavour compounds of Greek cotton honey,
J. Sci. Food Agric., 2005, 85, 9, 1444-1452, https://doi.org/10.1002/jsfa.2124
. [all data]