Bisabola-1,3,5,7(14)-tetraene
- Formula: C15H22
- Molecular weight: 202.3352
- IUPAC Standard InChIKey: OUOQVJYYZABQJT-UHFFFAOYSA-N
- Chemical structure:
View 3d structure (requires JavaScript / HTML 5) - Permanent link for this species. Use this link for bookmarking this species for future reference.

Van Den Dool and Kratz RI, non-polar column, custom temperature program

Column type | Active phase | I | Reference | Comment |
---|---|---|---|---|
Capillary | CP Sil 5 CB | 1483. | Adio and König, 2005 | Program: not specified |

Normal alkane RI, non-polar column, temperature ramp

Column type | Active phase | I | Reference | Comment |
---|---|---|---|---|
Capillary | CP Sil 5 CB | 1483. | Adio, 2005 | H2, 3. K/min; Column length: 25. m; Tstart: 50. C; Tend: 230. C |

References

Adio and König, 2005
Adio, A.M.; König, W.A.,
Sesquiterpene constituents from the essential oil of the liverwort Plagiochila asplenioides,
Phytochemistry, 2005, 66, 5, 599-609, https://doi.org/10.1016/j.phytochem.2005.01.015
. [all data]
Adio, 2005
Adio, A.M.,
Isolation and structure elucidation of sesquiterpenoids from the essential oils of some liverworths (Hepaticae), Dissertation, Hamburg University, 2005, 265. [all data]