3-Hydroxy-6-methylbutyryloxytropane

Kovats' RI, non-polar column, temperature ramp

View large format table.

Column type Active phase I Reference Comment
CapillaryHP-5MS1675.Doncheva, Berkov, et al., 200630. m/0.25 mm/0.25 μm, He, 4. K/min, 300. C @ 10. min; Tstart: 50. C
CapillaryHP-5MS1682.Doncheva, Berkov, et al., 200630. m/0.25 mm/0.25 μm, He, 4. K/min, 300. C @ 10. min; Tstart: 50. C

Normal alkane RI, non-polar column, temperature ramp

View large format table.

Column type Active phase I Reference Comment
CapillaryOV-11725.Zayed and Wink, 2004He, 120. C @ 3. min, 8. K/min; Column length: 30. m; Column diameter: 0.25 mm; Tend: 300. C

References

Doncheva, Berkov, et al., 2006
Doncheva, T.; Berkov, S.; Philipov, S., Comparative study of the alkaloids in tribe Datureae and their chemosystematic significance, Biochem. Syst. Ecol., 2006, 34, 6, 478-488, https://doi.org/10.1016/j.bse.2006.01.008 . [all data]

Zayed and Wink, 2004
Zayed, R.; Wink, M., Induction of tropane alkaloid formation in transformed root cultures of Brugmansia suaveolens (Solanaceae), Z. Naturforsch. C:, 2004, 59, 11-12, 863-867. [all data]