trans-Thujene
- Formula: C10H16
- Molecular weight: 136.2340
- IUPAC Standard InChIKey: KQAZVFVOEIRWHN-UWVGGRQHSA-N
- Chemical structure:
View 3d structure (requires JavaScript / HTML 5) - Stereoisomers:

Normal alkane RI, non-polar column, temperature ramp

Column type | Active phase | I | Reference | Comment |
---|---|---|---|---|
Capillary | DB-1 | 1110. | Rasooli and Owlia, 2005 | 60. m/0.25 mm/0.25 μm, He, 4. K/min; Tstart: 50. C; Tend: 250. C |
Capillary | DB-1 | 1110. | Rasooli and Razzaghi Abyaneh, 2004 | 60. m/0.25 mm/0.25 μm, He, 4. K/min; Tstart: 50. C; Tend: 250. C |

References

Rasooli and Owlia, 2005
Rasooli, I.; Owlia, P.,
Chemoprevention by thyme oils of Aspergillus parasiticus growth and aflatoxin production,
Phytochemistry, 2005, 66, 24, 2851-2856, https://doi.org/10.1016/j.phytochem.2005.09.029
. [all data]
Rasooli and Razzaghi Abyaneh, 2004
Rasooli, I.; Razzaghi Abyaneh, M.,
Inhibitory effects of Thyme oils on growth and aflatoxin production by Aspergillus parasiticus,
Food Control, 2004, 15, 6, 479-483, https://doi.org/10.1016/j.foodcont.2003.07.002
. [all data]