1,3-Cyclopentadiene, 1-octyl
- Formula: C13H22
- Molecular weight: 178.3138
- IUPAC Standard InChIKey: JGLVQJXCFCINBL-UHFFFAOYSA-N
- Chemical structure:
View 3d structure (requires JavaScript / HTML 5) - Permanent link for this species. Use this link for bookmarking this species for future reference.

Kovats' RI, non-polar column, isothermal

Column type | Active phase | Temperature (C) | I | Reference | Comment |
---|---|---|---|---|---|
Capillary | Squalane | 64. | 1310. | Sojak, Ruman, et al., 1987 | 50. m/0.25 mm/0.25 μm, H2 |

Kovats' RI, polar column, isothermal

Column type | Active phase | Temperature (C) | I | Reference | Comment |
---|---|---|---|---|---|
Capillary | Carbowax 20M | 64. | 1507.3 | Sojak, Ruman, et al., 1987 | 50. m/0.25 mm/0.25 μm, H2 |

References

Sojak, Ruman, et al., 1987
Sojak, L.; Ruman, J.; Janak, J.,
Characterization of Monoalkylcyclopentadiens by Retention-Structure Correlation in Capillary Gas Chromatography,
J. Chromatogr., 1987, 391, 79-87, https://doi.org/10.1016/S0021-9673(01)94306-7
. [all data]