9E,16E,23E-Tetraconta-trien-3-one
- Formula: C40H74O
- Molecular weight: 571.0150
- IUPAC Standard InChIKey: GJQPXCXKVSVWMJ-BMALKTGUSA-N
- Chemical structure:
View 3d structure (requires JavaScript / HTML 5) - Other names: Tetraconta-9E,16E,23E-trien-3-one

Van Den Dool and Kratz RI, non-polar column, custom temperature program

Column type | Active phase | I | Reference | Comment |
---|---|---|---|---|
Capillary | DB-5 | 4165. | Lopez, de Oteyza, et al., 2005 | 30. m/0.25 mm/0.25 μm, H2; Program: 70C(1min) => 10C/min => 140C => 4C/min => 310C(30min) |
Capillary | HP-5 | 4165. | López and Grimalt, 2004 | 30. m/0.25 mm/0.25 μm; Program: 90C(1min) => 15C/min => 150C => 4C/min => 310C(30min) |

References

Lopez, de Oteyza, et al., 2005
Lopez, J.F.; de Oteyza, T.G.; Teixidor, P.; Grimalt, J.O.,
Long chain alkenones in hypersaline and marine coastal microbial mats,
Org. Geochem., 2005, 36, 6, 861-872, https://doi.org/10.1016/j.orggeochem.2005.01.008
. [all data]
López and Grimalt, 2004
López, J.F.; Grimalt, J.O.,
Phenyl- and Cyclopentylimino Derivatization for Double Bond Location in Unsaturated C37-C40 Alkenones by GC-MS,
J. Am. Soc. Mass Spectrom., 2004, 15, 8, 1161-1172, https://doi.org/10.1016/j.jasms.2004.04.024
. [all data]