(E)-5,6-Epoxy-β-ionone
- Formula: C13H20O2
- Molecular weight: 208.2967
- IUPAC Standard InChIKey: ZTJZJYUGOJYHCU-RMKNXTFCSA-N
- Chemical structure:
View 3d structure (requires JavaScript / HTML 5) - Species with the same structure:
- Other names: trans- β-Ionone epoxide; (E)-4-(1,2-Epoxy-2,6,6-trimethyl-1-cyclohexyl)-3-buten-2-one; (E)-4-(2,2,6-trimethyl-7-oxabicyclo[4.1.0]-heptan-1-yl)but-3-en-2-one

Kovats' RI, non-polar column, temperature ramp

Column type | Active phase | I | Reference | Comment |
---|---|---|---|---|
Capillary | DB-1 | 1473. | Mevy, Bessiere, et al., 2006 | He, 60. C @ 3. min, 3. K/min; Column length: 25. m; Column diameter: 0.2 mm; Tend: 220. C |

Normal alkane RI, non-polar column, custom temperature program

Column type | Active phase | I | Reference | Comment |
---|---|---|---|---|
Capillary | DB-5 MS | 1441. | Zhu, Li, et al., 2008 | 30. m/0.25 mm/0.25 μm, Helium; Program: 50 0C (2.8 min) 5.5 0C/min -> 140 0C (1 min) 4.5 oC/min -> 220 0C -> 225 0C (2 min) 3.4 0C/min -> 265 0C (5 min) |
Capillary | DB-5 MS | 1479. | Zhu, Li, et al., 2008 | 30. m/0.25 mm/0.25 μm, Helium; Program: 50 0C (2.8 min) 5.5 0C/min -> 140 0C (1 min) 4.5 oC/min -> 220 0C -> 225 0C (2 min) 3.4 0C/min -> 265 0C (5 min) |

Normal alkane RI, polar column, custom temperature program

Column type | Active phase | I | Reference | Comment |
---|---|---|---|---|
Capillary | Supelcowax 10 | 1995. | Castioni and Kapetanidis, 1996 | 60. m/0.25 mm/0.25 μm, Helium; Program: 60 0C (10 min) 2 0C/min -> 80 0C 3 0C/min -> 100 0C 4 0C/min -> 220 0C (30 min) |
Capillary | Supelcowax 10 | 2009. | Castioni and Kapetanidis, 1996 | 60. m/0.25 mm/0.25 μm, Helium; Program: not specified |
Capillary | Supelcowax 10 | 2015. | Castioni and Kapetanidis, 1996 | 60. m/0.25 mm/0.25 μm, Helium; Program: not specified |

References

Mevy, Bessiere, et al., 2006
Mevy, J.P.; Bessiere, J.M.; Rabier, J.; Dherbomez, M.; Ruzzier, M.; Millogo, J.; Viano, J.,
Composition and antimicrobial activities of the essential oil of Triumfetta rhomboidea Jacq.,
Flavour Fragr. J., 2006, 21, 1, 80-83, https://doi.org/10.1002/ffj.1511
. [all data]
Zhu, Li, et al., 2008
Zhu, M.; Li, E.; He, H.,
Determination of volatile chemical constitutes in tea by simultaneous distillation extraction, vacuum hydrodistillation and thermal desrption,
Chromatographia, 2008, 68, 7/8, 603-610, https://doi.org/10.1365/s10337-008-0732-1
. [all data]
Castioni and Kapetanidis, 1996
Castioni, P.; Kapetanidis, I.,
Volatile constituents from Brunfelsia grandiflora ssp. grandiflora: qualitative analysis by GC-MS,
Scientia Pharmaceutica, 1996, 64, 83-91. [all data]