S-pinocamphone
- Formula: C10H16O
- Molecular weight: 152.2334
- IUPAC Standard InChIKey: MQPHVIPKLRXGDJ-GJMOJQLCSA-N
- Chemical structure:
View 3d structure (requires JavaScript / HTML 5) - Stereoisomers:
- [1S-(1α,2β,5α)]-2,6,6-trimethylbicyclo[3.1.1]heptan-3-one
- Bicyclo[3.1.1]heptan-3-one, 2,6,6-trimethyl-, (1α,2β,5α)-
- Bicyclo[3.1.1]heptan-3-one, 2,6,6-trimethyl-
- Isopinocamphone
- Bicyclo[3.1.1]heptan-3-one, 2,6,6-trimethyl-, (1α,2α,5α)-
- (E)-Pinanone
- pinocamphone isomer (T)
- (Z)-Pinocamphone
- cis-Pinocamphone

Van Den Dool and Kratz RI, non-polar column, temperature ramp

Column type | Active phase | I | Reference | Comment |
---|---|---|---|---|
Capillary | DB-5 | 1175. | Tampieri, Galuppi, et al., 2003 | 30. m/0.25 mm/0.25 μm, He, 3. K/min; Tstart: 60. C; Tend: 240. C |

References

Tampieri, Galuppi, et al., 2003
Tampieri, M.P.; Galuppi, R.; Carelle, M.S.; Macchioni, F.; Cioni, P.L.; Morelli, I.,
Effect of selected essential oils and pure compounds on Saprolegnia parasitica,
Pharm. Biol., 2003, 41, 8, 584-591, https://doi.org/10.1080/13880200390501839
. [all data]