Iso-β-bisabolol
- Formula: C15H26O
- Molecular weight: 222.3663
- IUPAC Standard InChIKey: WTVHAMTYZJGJLJ-GJZGRUSLSA-N
- Chemical structure:
View 3d structure (requires JavaScript / HTML 5) - Species with the same structure:
- Stereoisomers:

Normal alkane RI, non-polar column, temperature ramp

Column type | Active phase | I | Reference | Comment |
---|---|---|---|---|
Capillary | HP-5 | 1651. | Braun, Meier, et al., 2003 | 15. m/0.53 mm/1.2 μm, He, 4. K/min; Tstart: 120. C; Tend: 220. C |

Normal alkane RI, polar column, temperature ramp

Column type | Active phase | I | Reference | Comment |
---|---|---|---|---|
Capillary | DB-Wax | 2134. | Braun, Meier, et al., 2003 | 27. m/0.53 mm/0.20 μm, He, 4. K/min; Tstart: 120. C; Tend: 220. C |

References

Braun, Meier, et al., 2003
Braun, N.A.; Meier, M.; Schmaus, G.; Hölscher, B.; Pickenhagen, W.,
Enantioselectivity in odor perception: synthesis and olfactory properties of iso-β-bisabolol, a new natural product,
Helv. Chim. Acta, 2003, 86, 7, 2698-2708, https://doi.org/10.1002/hlca.200390219
. [all data]