cis-2-t-butyl-peroxy-p-mentha-1(7),8-diene
- Formula: C14H24O2
- Molecular weight: 224.3392
- IUPAC Standard InChIKey: RGCDJHCIWRIPJR-STQMWFEESA-N
- Chemical structure:

Normal alkane RI, non-polar column, temperature ramp

Column type | Active phase | I | Reference | Comment |
---|---|---|---|---|
Capillary | SE-54 | 1300. | Silva A.D., Patitucci M.L., et al., 2002 | 30. m/0.32 mm/0.25 μm, H2, 5. K/min; Tstart: 40. C; Tend: 240. C |

References

Silva A.D., Patitucci M.L., et al., 2002
Silva A.D.; Patitucci M.L.; Bizzo H.R.; D'Elia E.; Antunes O.A.C.,
Wacker PdCl2-CuCl2 catalytic oxidation process: Oxidation of limonene,
Catalysis Communications, 2002, 3, 9, 435-440, https://doi.org/10.1016/S1566-7367(02)00174-7
. [all data]