Succinylacetone, TMS, # 2
- Formula: C13H26O4Si2
- Molecular weight: 302.5141
- IUPAC Standard InChIKey: JTZWNADIMKBHCO-BENRWUELSA-N
- Chemical structure:
View 3d structure (requires JavaScript / HTML 5) - Other names: Succinylacetone, TMS, # 1; Succinylacetone, TMS

Normal alkane RI, non-polar column, temperature ramp

Column type | Active phase | I | Reference | Comment |
---|---|---|---|---|
Capillary | HP-5MS | 1644. | Lee, Yanamandra, et al., 2002 | 30. m/0.25 mm/0.25 μm, He, 70. C @ 3. min, 4. K/min, 280. C @ 3. min |

References

Lee, Yanamandra, et al., 2002
Lee, B.Y.; Yanamandra, K.; Thurmon, T.F.,
Quantitative estimation of organic analytes with a capillary column,
Am. Clin. Lab., 2002, May, 30-34. [all data]