Gluconic acid lactone, TMS # 2
- Formula: C18H42O6Si4
- Molecular weight: 466.8645
- IUPAC Standard InChIKey: VNGTZLYNGGLPIZ-NXOAAHMSSA-N
- Chemical structure:
View 3d structure (requires JavaScript / HTML 5) - Species with the same structure:
- Stereoisomers:
- Other names: Glucono-1,5-lactone, TMS # 2; GLUCONIC ACID LACTONE 4TMS-2

Normal alkane RI, non-polar column, temperature ramp

Column type | Active phase | I | Reference | Comment |
---|---|---|---|---|
Capillary | HP-5MS | 1923. | Lee, Yanamandra, et al., 2002 | 30. m/0.25 mm/0.25 μm, He, 70. C @ 3. min, 4. K/min, 280. C @ 3. min |
Capillary | HP-5MS | 1926. | Lee, Yanamandra, et al., 2002 | 30. m/0.25 mm/0.25 μm, He, 70. C @ 3. min, 4. K/min, 280. C @ 3. min |

References

Lee, Yanamandra, et al., 2002
Lee, B.Y.; Yanamandra, K.; Thurmon, T.F.,
Quantitative estimation of organic analytes with a capillary column,
Am. Clin. Lab., 2002, May, 30-34. [all data]