9-Oxo-11-octadecenoic acid, 13-hydroxy, PFBO, TMS, methyl ester, # 2

Kovats' RI, non-polar column, temperature ramp

View large format table.

Column type Active phase I Reference Comment
CapillaryDB-12865.Spiteller, Kern, et al., 200130. m/0.32 mm/0.10 μm, H2, 60. C @ 5. min, 3. K/min, 280. C @ 15. min

References

Spiteller, Kern, et al., 2001
Spiteller, P.; Kern, W.; Reiner, J.; Spiteller, G., Aldehydic lipid peroxidation products derived from linoleic acid, Biochim. Biophys. Acta, 2001, 1531, 3, 188-208, https://doi.org/10.1016/S1388-1981(01)00100-7 . [all data]