coronene-d12
- Formula: C24D12
- Molecular weight: 312.4260
- IUPAC Standard InChIKey: VPUGDVKSAQVFFS-AQZSQYOVSA-N
- Chemical structure:
View 3d structure (requires JavaScript / HTML 5) - Isotopologues:

Lee's RI, non-polar column, custom temperature program

Column type | Active phase | I | Reference | Comment |
---|---|---|---|---|
Capillary | 5 % Phenyl methyl siloxane | 549.71 | Allen J.O., Durant J.L., et al., 1998 | Program: not specified |

References

Allen J.O., Durant J.L., et al., 1998
Allen J.O.; Durant J.L.; Dookeran N.M.; Taghizadeh K.; Plummer E.F.; Lafleur A.L.; Sarofim A.F.; Smith K.A.,
Measurement of C24H14 polycyclic aromatic hydrocarbons associated with a size-segregated urban aerosol,
Environ. Sci. Technol., 1998, 32, 13, 1928-1932, https://doi.org/10.1021/es970919r
. [all data]